Hi,
beim Compilieren tritt bei mir irgendwann folgender Fehler aus (make all):
cd ../obj_s; powerpc-tuxbox-linux-gnu-gcc -I../ncurses -I. -DNDEBUG -I. -I../include -I/dbox2/cdkroot/include -DHAVE_CONFIG_H -O2 -mcpu=823
-fPIC -c ../ncurses/comp_captab.c
../ncurses/comp_captab.c: In function `_nc_get_table':
../ncurses/comp_captab.c:73: `_nc_cap_table' undeclared (first use in this function)
../ncurses/comp_captab.c:73: (Each undeclared identifier is reported only once
../ncurses/comp_captab.c:73: for each function it appears in.)
../ncurses/comp_captab.c:73: `_nc_info_table' undeclared (first use in this function)
make[2]: *** [../obj_s/comp_captab.o] Error 1
make[2]: Leaving directory `/root/tuxbox-cvs/cdk/ncurses-5.2/ncurses'
make[1]: *** [install.libs] Error 2
make[1]: Leaving directory `/root/tuxbox-cvs/cdk/ncurses-5.2'
make: *** [.libncurses] Error 2
linux:~/tuxbox-cvs/cdk #
Ich habe unter Suse 7.3 compiliert.
Grüsse,
NoClue
ncurses
-
- Einsteiger
- Beiträge: 226
- Registriert: Dienstag 30. Oktober 2001, 00:00